JT Harness : Tests that failed

Tests are grouped by their final status message.

Execution failed: `main' threw exception: java.lang.AssertionError: zero return code from javadoc

Execution failed: `main' threw exception: java.lang.Error: 1 of 5 subtests failed for bug 4652655-4857717 (TestClassCrossReferences)

Execution failed: `main' threw exception: java.lang.Error: 3 of 6 subtests failed for bug 8006248 (TestCustomTag)

Execution failed: `main' threw exception: java.lang.Error: 8 of 32 subtests failed for bug 4764045 (TestValueTag)

Execution failed: `main' threw exception: java.lang.Exception: 1 errors occurred.

Execution failed: `main' threw exception: java.lang.Exception: 3 errors occurred

Execution failed: `main' threw exception: java.lang.Exception: unexpected output from compiler; expected: T6873845.java:73:9: compiler.warn.sun.proprietary: sun.misc.Unsafe 1 warning found: - compiler.warn.path.element.not.found: /usr/share/java/junit.jar T6873845.java:73:9: compiler.warn.sun.proprietary: sun.misc.Unsafe 2 warnings


Report generated on Sep 1, 2026 5:38:34 PM
Using JT Harness 6.0 b22; built on January 3, 1970 12:00:00 AM UTC with openjdk version "11.0.17" 2022-10-18