JT Harness : Tests that failed

Tests are grouped by their final status message.

Execution failed: `main' threw exception: java.io.IOException: Cannot run program "lpstat": error=2, No such file or directory

Execution failed: `main' threw exception: java.lang.Exception: Failed to get the preferable key aliases

Execution failed: `main' threw exception: java.lang.Exception: failures: 1

Execution failed: `main' threw exception: java.lang.Exception: failures: 19

Execution failed: `main' threw exception: java.lang.Exception: failures: 2

Execution failed: `main' threw exception: java.lang.Exception: failures: 20

Execution failed: `main' threw exception: java.lang.Exception: failures: 21

Execution failed: `main' threw exception: java.lang.Exception: failures: 24

Execution failed: `main' threw exception: java.lang.Exception: failures: 3

Execution failed: `main' threw exception: java.lang.Exception: failures: 34

Execution failed: `main' threw exception: java.lang.Exception: failures: 4

Execution failed: `main' threw exception: java.lang.Exception: failures: 5

Execution failed: `main' threw exception: java.lang.RuntimeException: No printer found. TEST ABORTED

Execution failed: `main' threw exception: java.lang.RuntimeException: Printer is required for this test. TEST ABORTED

Execution failed: `main' threw exception: java.lang.RuntimeException: TEST FAILED

Execution failed: `main' threw exception: java.lang.RuntimeException: Uncaught exception thrown in test method TestJapaneseLineBreak

Execution failed: `main' threw exception: java.lang.RuntimeException: Unexpected exception:java.net.UnknownHostException: bugs.openjdk.java.net: Name or service not known

Execution failed: `main' threw exception: java.lang.RuntimeException: restricted packages are not consistent with java.security file

Execution failed: `main' threw exception: java.net.UnknownHostException: dummyserver.java.net: Name or service not known

Execution failed: exit code 1


Report generated on Sep 1, 2026 6:58:34 PM
Using JT Harness 6.0 b22; built on January 3, 1970 12:00:00 AM UTC with openjdk version "11.0.17" 2022-10-18